BDBM111262 US8614253, 43-22::US9241942, 27-22
SMILES Oc1c(F)cc(cc1C=O)-c1ccsc1
InChI Key InChIKey=BZFZVODKRRACFK-UHFFFAOYSA-N
Data  2 IC50  1 EC50
  Tab Delimited (TSV)   2D SDfile   Computed 3D by Vconf -m prep SDfile
Find this compound or compounds like it in BindingDB:
Activity Spreadsheet -- Enzyme Inhibition Constant Data from BindingDB
Found 3 hits for monomerid = 111262
TargetSerine/threonine-protein kinase/endoribonuclease IRE1(Homo sapiens (Human))
Mannkind
US Patent
LigandPNGBDBM111262(US8614253, 43-22 | US9241942, 27-22)
Affinity DataIC50:  74nMpH: 7.5 T: 2°C. Assay description: IRE-1 alpha, T1 RNase, and RNase A assays carried out in vitro with several o-vanillin derivatives to demonstrate selectivity of the derivatives for ...
Ligand InfoPC cidPC sid
In DepthDetails US Patent
TargetSerine/threonine-protein kinase/endoribonuclease IRE1(Homo sapiens (Human))
Mannkind
US Patent
LigandPNGBDBM111262(US8614253, 43-22 | US9241942, 27-22)
Affinity DataEC50:  8.00E+4nM. Assay description: Initial cell-based XBP-1 mRNA splicing assays confirmed IRE-1α inhibition with several potent 5-bromo and 6 bromo o-vanillins. HEK293 cells were...
Ligand InfoPC cidPC sid
In DepthDetails US Patent
TargetSerine/threonine-protein kinase/endoribonuclease IRE1(Homo sapiens (Human))
Mannkind
US Patent
LigandPNGBDBM111262(US8614253, 43-22 | US9241942, 27-22)
Affinity DataIC50:  74nMpH: 7.5Assay Description:A fusion protein comprising glutathione S transferase (GST) and human IRE-1α (GST-IRE-1α) was obtained from a 500 ml baculovirus-infected i...
Ligand InfoPC cidPC sid
In DepthDetails US Patent