BDBM111334 US8614253, 28-10::US9241942, 28-8
SMILES Oc1ccc(cc1C=O)-c1cccc(c1)C(=O)NCCN1CCCCC1
InChI Key InChIKey=HUKZJGIBVZQYMU-UHFFFAOYSA-N
Data  2 IC50
  Tab Delimited (TSV)   2D SDfile   Computed 3D by Vconf -m prep SDfile
Find this compound or compounds like it in BindingDB:
Activity Spreadsheet -- Enzyme Inhibition Constant Data from BindingDB
Found 2 hits for monomerid = 111334
TargetSerine/threonine-protein kinase/endoribonuclease IRE1(Homo sapiens (Human))
Mannkind
US Patent
LigandPNGBDBM111334(US8614253, 28-10 | US9241942, 28-8)
Affinity DataIC50:  66nMpH: 7.5Assay Description:A fusion protein comprising glutathione S transferase (GST) and human IRE-1α (GST-IRE-1α) was obtained from a 500 ml baculovirus-infected i...
Ligand InfoPC cidPC sid
In DepthDetails US Patent
TargetSerine/threonine-protein kinase/endoribonuclease IRE1(Homo sapiens (Human))
Mannkind
US Patent
LigandPNGBDBM111334(US8614253, 28-10 | US9241942, 28-8)
Affinity DataIC50:  66nMpH: 7.5 T: 2°C. Assay description: IRE-1 alpha, T1 RNase, and RNase A assays carried out in vitro with several o-vanillin derivatives to demonstrate selectivity of the derivatives for ...
Ligand InfoPC cidPC sid
In DepthDetails US Patent