BDBM111335 US8614253, 28-11::US9241942, 28-9
SMILES COc1ccc(CNC(=O)c2cccc(c2)-c2cc(F)c(O)c(C=O)c2)cc1
InChI Key InChIKey=ZSIHEUPSXOOHFL-UHFFFAOYSA-N
Data  2 IC50
  Tab Delimited (TSV)   2D SDfile   Computed 3D by Vconf -m prep SDfile
Find this compound or compounds like it in BindingDB:
Activity Spreadsheet -- Enzyme Inhibition Constant Data from BindingDB
Found 2 hits for monomerid = 111335
TargetSerine/threonine-protein kinase/endoribonuclease IRE1(Homo sapiens (Human))
Mannkind
US Patent
LigandPNGBDBM111335(US8614253, 28-11 | US9241942, 28-9)
Affinity DataIC50:  40nMpH: 7.5Assay Description:A fusion protein comprising glutathione S transferase (GST) and human IRE-1α (GST-IRE-1α) was obtained from a 500 ml baculovirus-infected i...
In DepthDetails US Patent
TargetSerine/threonine-protein kinase/endoribonuclease IRE1(Homo sapiens (Human))
Mannkind
US Patent
LigandPNGBDBM111335(US8614253, 28-11 | US9241942, 28-9)
Affinity DataIC50:  40nMpH: 7.5 T: 2°C. Assay description: IRE-1 alpha, T1 RNase, and RNase A assays carried out in vitro with several o-vanillin derivatives to demonstrate selectivity of the derivatives for ...
In DepthDetails US Patent