BDBM111496 US8618286, 22
SMILES CN(C)CCCN1CCSc2cc(ccc12)N=C(N)c1cccs1
InChI Key InChIKey=AIXCRSGMKMJRRJ-UHFFFAOYSA-N
Data  3 IC50
  Tab Delimited (TSV)   2D SDfile   Computed 3D by Vconf -m prep SDfile
Find this compound or compounds like it in BindingDB:
Activity Spreadsheet -- Enzyme Inhibition Constant Data from BindingDB
Found 3 hits for monomerid = 111496
TargetNitric oxide synthase, brain(Homo sapiens (Human))
Neuraxon
US Patent
LigandPNGBDBM111496(US8618286, 22)
Affinity DataIC50:  14nM. Assay description: Primary stock solutions of test compounds at a concentration of 6 mM were prepared from the 2 to 5 mg powder. The primary stock solutions of each tes...
In DepthDetails US Patent
TargetNitric oxide synthase, inducible(Homo sapiens (Human))
Neuraxon
US Patent
LigandPNGBDBM111496(US8618286, 22)
Affinity DataIC50:  1.15E+5nM. Assay description: Recombinant human inducible NOS (iNOS) was produced in Baculovirus-infected Sf9 cells (ALEXIS). In a radiometric method, NO synthase activity was det...
In DepthDetails US Patent
TargetNitric oxide synthase, endothelial(Homo sapiens (Human))
Neuraxon
US Patent
LigandPNGBDBM111496(US8618286, 22)
Affinity DataIC50:  1.21E+4nM. Assay description: Primary stock solutions of test compounds at a concentration of 6 mM were prepared from the 2 to 5 mg powder. The primary stock solutions of each tes...
In DepthDetails US Patent