BDBM111594 US8624022, OGT4154
SMILES N[C@H]1CCN(C1)C(=O)CN(CC(=O)NCc1cccc(Cl)c1)c1ccc(Oc2ccccc2)cc1
InChI Key InChIKey=GCGTVJOAENIZRB-QFIPXVFZSA-N
Data  2 IC50
  Tab Delimited (TSV)   2D SDfile   Computed 3D by Vconf -m prep SDfile
Find this compound or compounds like it in BindingDB:
Activity Spreadsheet -- Enzyme Inhibition Constant Data from BindingDB
Found 2 hits for monomerid = 111594
Target1,3-beta-glucan synthase(Neosartorya fumigata (Aspergillus fumigatus))
Ucb Pharma
US Patent
LigandPNGBDBM111594(US8624022, OGT4154)
Affinity DataIC50:  5.60E+3nMpH: 8.0 T: 2°C. Assay description: The glucan synthase assay follows the incorporation of tritiated UDP-glucose into acid insoluble β-glucan as catalysed by the glucan synthase ac...
In DepthDetails US Patent
Target1,3-beta-glucan synthase(Candida albicans (Yeast))
Ucb Pharma
US Patent
LigandPNGBDBM111594(US8624022, OGT4154)
Affinity DataIC50:  8.00E+3nMpH: 8.0 T: 2°C. Assay description: The glucan synthase assay follows the incorporation of tritiated UDP-glucose into acid insoluble β-glucan as catalysed by the glucan synthase ac...
In DepthDetails US Patent