BDBM111900 US8623901, 227
SMILES COc1ncc(cn1)-c1ccccc1Cc1nc2n(ncc2c(=O)[nH]1)C1CCOCC1
InChI Key InChIKey=GQMAGCBRTHJDHV-UHFFFAOYSA-N
Data  1 IC50
  Tab Delimited (TSV)   2D SDfile   Computed 3D by Vconf -m prep SDfile
Find this compound or compounds like it in BindingDB:
Activity Spreadsheet -- Enzyme Inhibition Constant Data from BindingDB
Found 1 hit for monomerid = 111900
TargetHigh affinity cGMP-specific 3',5'-cyclic phosphodiesterase 9A(Homo sapiens (Human))
Boehringer Ingelheim International
US Patent
LigandPNGBDBM111900(US8623901, 227)
Affinity DataIC50:  8nMpH: 7.5 T: 2°C. Assay description: The PDE9A2 enzymatic activity assay was run as scintillation proximity assay (SPA), in general according to the protocol of the manufacturer (GE Heal...
In DepthDetails US Patent