BDBM111938 US8618107, 104
SMILES Cn1cc(cc(Nc2ccncn2)c1=O)-c1cccc(N2CCc3c4CCCCc4sc3C2=O)c1CO
InChI Key InChIKey=LRUSCQLECOYKHK-UHFFFAOYSA-N
Data  3 IC50
  Tab Delimited (TSV)   2D SDfile   Computed 3D by Vconf -m prep SDfile
Find this compound or compounds like it in BindingDB:
Activity Spreadsheet -- Enzyme Inhibition Constant Data from BindingDB
Found 3 hits for monomerid = 111938
TargetTyrosine-protein kinase BTK(Homo sapiens (Human))
Gilead Connecticut
US Patent
LigandPNGBDBM111938(US8618107, 104)
Affinity DataIC50:  0.870nMpH: 7.5Assay Description:A generalized procedure for a standard biochemical Btk Kinase Assay that can be used to test Formula I compounds. Alternatively, the Lanthascreen ass...
In DepthDetails US Patent
TargetTyrosine-protein kinase BTK(Homo sapiens (Human))
Gilead Connecticut
US Patent
LigandPNGBDBM111938(US8618107, 104)
Affinity DataIC50:  1nM. Assay description: Inhibition of recombinant human full length His-tagged BTK expressed in baculovirus expression system by Z-LYTE assay
In DepthDetails ArticlePubMed
TargetTyrosine-protein kinase BTK(Mus musculus)
Genentech
Curated by ChEMBL
LigandPNGBDBM111938(US8618107, 104)
Affinity DataIC50:  87nM. Assay description: Inhibition of BTK in goat F(ab')2anti-mouse IgM-stimulated Balb/c mouse splenocyte B cells assessed as suppression of BCR-mediated CD86 induction pre...
In DepthDetails ArticlePubMed