BDBM112452 US10112950, Example 101::US10556908, Example 101::US9695180, 101
SMILES CN(C)C1CCN(CC1)c1nc(-c2ccc(cc2)C#N)c(-c2ccc3nccnc3c2)n2ccnc12
InChI Key InChIKey=KRAAZJYHDWZNBJ-UHFFFAOYSA-N
Data  3 IC50
  Tab Delimited (TSV)   2D SDfile   Computed 3D by Vconf -m prep SDfile
Find this compound or compounds like it in BindingDB:
Activity Spreadsheet -- Enzyme Inhibition Constant Data from BindingDB
Found 3 hits for monomerid = 112452
TargetLysine-specific histone demethylase 1A [151-852](Homo sapiens (Human))
Incyte
US Patent
LigandPNGBDBM112452(US10112950, Example 101 | US10556908, Example 101 ...)
Affinity DataIC50: <50nMpH: 7.5 T: 2°C. Assay description: 10 μL of 1 nM LSD-1 enzyme (ENZO BML-SE544-0050) in the assay buffer (50 mM Tris, pH 7.5, 0.01% Tween-20, 25 mM NaCl, 5 mM DTT) were preincubated ...
Ligand InfoPC cidPC sid
In DepthDetails US Patent
TargetLysine-specific histone demethylase 1A(Homo sapiens (Human))
Incyte
US Patent
LigandPNGBDBM112452(US10112950, Example 101 | US10556908, Example 101 ...)
Affinity DataIC50: <50nM. Assay description: LANCE LSD1/KDM1A demethylase assay 10 μL of 1 nM LSD-1 enzyme (ENZO BML-SE544-0050) in the assay buffer (50 mM Tris, pH 7.5, 0.01% Tween-20, 25 ...
Ligand InfoPC cidPC sid
In DepthDetails US Patent
TargetLysine-specific histone demethylase 1A(Homo sapiens (Human))
Incyte
US Patent
LigandPNGBDBM112452(US10112950, Example 101 | US10556908, Example 101 ...)
Affinity DataIC50: <50nMpH: 7.5Assay Description:LANCE LSD1/KDM1A demethylase assay-10 μL of 1 nM LSD-1 enzyme (ENZO BML-SE544-0050) in the assay buffer (50 mM Tris, pH 7.5, 0.01% Tween-20, 25 ...
Ligand InfoPC cidPC sid
In DepthDetails US Patent