BDBM112571 US8618103, I-67
SMILES CC(C)(C)NS(=O)(=O)N1CCC[C@@H](C1)Nc1ncccc1-c1cnc2[nH]ccc2n1
InChI Key InChIKey=LNPNJZPJGDLRBR-AWEZNQCLSA-N
Data  1 KI  2 IC50
  Tab Delimited (TSV)   2D SDfile   Computed 3D by Vconf -m prep SDfile
Find this compound or compounds like it in BindingDB:
Activity Spreadsheet -- Enzyme Inhibition Constant Data from BindingDB
Found 2 hits for monomerid = 112571
TargetTyrosine-protein kinase JAK3(Homo sapiens (Human))
Hoffmann-La Roche
US Patent
LigandPNGBDBM112571(US8618103, I-67)
Affinity DataKi:  0.0323nM IC50:  0.0647nMpH: 7.2Assay Description:The kinase activity of all three JAK kinases is measured using a radioactive, end-point assay and with trace amounts of 33P-ATP.
In DepthDetails US Patent
TargetTyrosine-protein kinase JAK2(Homo sapiens (Human))
Hoffmann-La Roche
US Patent
LigandPNGBDBM112571(US8618103, I-67)
Affinity DataIC50:  0.222nMpH: 7.2Assay Description:The kinase activity of all three JAK kinases is measured using a radioactive, end-point assay and with trace amounts of 33P-ATP.
In DepthDetails US Patent