BDBM112651 Ethyl 6-methyl-4-(4-methylphenyl)-2-thioxo-1,2,3,4- tetrahydropyrimidine-5-carboxylate (4l)
SMILES CCOC(=O)C1C(NC(=S)N=C1C)c1ccc(C)cc1
InChI Key InChIKey=HLVSTRRTAQUYKT-UHFFFAOYSA-N
Data  1 IC50
  Tab Delimited (TSV)   2D SDfile   Computed 3D by Vconf -m prep SDfile
Find this compound or compounds like it in BindingDB:
Activity Spreadsheet -- Enzyme Inhibition Constant Data from BindingDB
Found 1 hit for monomerid = 112651
TargetAlpha-glucosidase MAL12(Saccharomyces cerevisiae)
Comsats Institute Of Information Technology
LigandPNGBDBM112651(Ethyl 6-methyl-4-(4-methylphenyl)-2-thioxo-1,2,3,4...)
Affinity DataIC50:  1.25E+5nMpH: 6.8 T: 2°C. Assay description: Reaction mixture (100 µL) contained 70 µL 50 mM Na2HPO4 buffer, pH 6.8, 10 µL test compound (0.5 mM), followed by the addition of 10 &...
In DepthDetails ArticlePubMed