BDBM112667 US8623863, 2-10
SMILES CC1CCCC(COc2ccc(F)cn2)CN1C(=O)c1cc(C)ccc1-n1nccn1
InChI Key InChIKey=XFVPZBSOZQCWGS-UHFFFAOYSA-N
Data  2 KI
  Tab Delimited (TSV)   2D SDfile   Computed 3D by Vconf -m prep SDfile
Find this compound or compounds like it in BindingDB:
Activity Spreadsheet -- Enzyme Inhibition Constant Data from BindingDB
Found 2 hits for monomerid = 112667
TargetOrexin receptor type 2(Homo sapiens (Human))
Merck Sharp & Dohme
US Patent
LigandPNGBDBM112667(US8623863, 2-10)
Affinity DataKi:  9.70nM. Assay description: Compound potency can be assessed by a radioligand binding assay (described in Bergman et. al. Bioorg. Med. Chem. Lett. 2008, 18, 1425-1430) in which ...
In DepthDetails US Patent
TargetOrexin/Hypocretin receptor type 1(Rattus norvegicus (Rat))
Merck Sharp & Dohme
US Patent
LigandPNGBDBM112667(US8623863, 2-10)
Affinity DataKi:  150nM. Assay description: Compound potency can be assessed by a radioligand binding assay (described in Bergman et. al. Bioorg. Med. Chem. Lett. 2008, 18, 1425-1430) in which ...
In DepthDetails US Patent