BDBM112769 US8629141, 39
SMILES OC(=O)N1CC(C1)NC(=O)[C@@H]1NC2(CCCCC2)[C@]2([C@H]1c1cccc(Cl)c1F)C(=O)Nc1cc(Cl)ccc21
InChI Key InChIKey=LBWSUSASHAUZFI-ZVUIFXONSA-N
Data  1 IC50
  Tab Delimited (TSV)   2D SDfile   Computed 3D by Vconf -m prep SDfile
Find this compound or compounds like it in BindingDB:
Activity Spreadsheet -- Enzyme Inhibition Constant Data from BindingDB
Found 1 hit for monomerid = 112769
TargetE3 ubiquitin-protein ligase Mdm2(Homo sapiens (Human))
University Of Michigan
US Patent
LigandPNGBDBM112769(US8629141, 39)
Affinity DataIC50: <100nM. Assay description: The binding affinity of the MDM2 inhibitors disclosed herein was determined using a fluorescence polarization-based (FP-based) binding assay using a ...
In DepthDetails US Patent