BDBM112776 US8629135, SW-12
SMILES CCN(CC)CCCOC(=O)CC1c2ccccc2C=Cc2ccccc12
InChI Key InChIKey=XHNZGIZVNQUFQU-UHFFFAOYSA-N
Data  1 IC50
  Tab Delimited (TSV)   2D SDfile   Computed 3D by Vconf -m prep SDfile
Find this compound or compounds like it in BindingDB:
Activity Spreadsheet -- Enzyme Inhibition Constant Data from BindingDB
Found 1 hit for monomerid = 112776
TargetProto-oncogene tyrosine-protein kinase receptor Ret(Homo sapiens (Human))
Queen'S University At Kingston
US Patent
LigandPNGBDBM112776(US8629135, SW-12)
Affinity DataIC50:  4.00E+3nMpH: 7.4 T: 2°C. Assay description: Approximately 5-20 μg of purified GST-RET proteins were incubated with 1 mM ATP in 20 μL kinase buffer (10 mM Tris-HCl, 5 mM MgCl2, pH 7.4)...
Ligand InfoPC cidPC sid
In DepthDetails US Patent