BDBM11283 2-[(5-cyano-6-oxo-4-phenyl-1,6-dihydropyrimidin-2-yl)sulfanyl]-N-[3-(trifluoromethyl)phenyl]acetamide::acs.jmedchem.1c00409_ST.776::pyrimidinone-containing compound 20
SMILES FC(F)(F)c1cccc(NC(=O)CSc2nc(-c3ccccc3)c(C#N)c(=O)[nH]2)c1
InChI Key InChIKey=FNZHACBCLXJSBM-UHFFFAOYSA-N
Data  2 IC50
  Tab Delimited (TSV)   2D SDfile   Computed 3D by Vconf -m prep SDfile
Find this compound or compounds like it in BindingDB:
Activity Spreadsheet -- Enzyme Inhibition Constant Data from BindingDB
Found 2 hits for monomerid = 11283
TargetReplicase polyprotein 1ab(Human SARS coronavirus (SARS-CoV) (Severe acute re...)
Michigan State University
LigandPNGBDBM11283(2-[(5-cyano-6-oxo-4-phenyl-1,6-dihydropyrimidin-2-...)
Affinity DataIC50:  2.00E+5nM. Assay description: This is a review article. Please point to the original journal.
In DepthDetails ArticlePubMed
TargetReplicase polyprotein 1ab(Human SARS coronavirus (SARS-CoV) (Severe acute re...)
Michigan State University
LigandPNGBDBM11283(2-[(5-cyano-6-oxo-4-phenyl-1,6-dihydropyrimidin-2-...)
Affinity DataIC50:  2.00E+5nM. Assay description: The effects of compound on enzyme activity were measured by using a fluorogenic peptide cleavage assay. Enhanced fluorescence caused by cleavage of t...
In DepthDetails ArticlePubMed