BDBM113089 US8633206, 7
SMILES CN([C@H]1CC[C@H](CS(=O)(=O)N2CCCC(C2)OCC(N)=O)CC1)c1ncnc2[nH]ccc12
InChI Key InChIKey=NCYHYKCOLXQCKS-BDWYFLKXSA-N
Data  3 IC50
  Tab Delimited (TSV)   2D SDfile   Computed 3D by Vconf -m prep SDfile
Find this compound or compounds like it in BindingDB:
Activity Spreadsheet -- Enzyme Inhibition Constant Data from BindingDB
Found 3 hits for monomerid = 113089
TargetTyrosine-protein kinase JAK3(Homo sapiens (Human))
Pfizer
US Patent
LigandPNGBDBM113089(US8633206, 7)
Affinity DataIC50:  173nMpH: 7.4Assay Description:A peptide mobility shift assay was used to quantify the phosphorylation of the JAKtide (JAK2 and JAK3) or the IRS-1 peptide (JAK1 and Tyk2). Reaction...
In DepthDetails US Patent
TargetTyrosine-protein kinase JAK1(Homo sapiens (Human))
Pfizer
US Patent
LigandPNGBDBM113089(US8633206, 7)
Affinity DataIC50:  2.96nMpH: 7.4Assay Description:A peptide mobility shift assay was used to quantify the phosphorylation of the JAKtide (JAK2 and JAK3) or the IRS-1 peptide (JAK1 and Tyk2). Reaction...
In DepthDetails US Patent
TargetTyrosine-protein kinase JAK2(Homo sapiens (Human))
Pfizer
US Patent
LigandPNGBDBM113089(US8633206, 7)
Affinity DataIC50:  18.3nMpH: 7.4Assay Description:A peptide mobility shift assay was used to quantify the phosphorylation of the JAKtide (JAK2 and JAK3) or the IRS-1 peptide (JAK1 and Tyk2). Reaction...
In DepthDetails US Patent