BDBM11322 (3-chloro-phenyl)-(4-{2-[2-(1H-imidazol-4-yl)-ethylamino]-pyridin-4-yl}-pyrimidin-2-yl)-amine::CGP062644::N-(3-chlorophenyl)-4-(2-{[2-(1H-imidazol-4-yl)ethyl]amino}pyridin-4-yl)pyrimidin-2-amine
SMILES Clc1cccc(Nc2nccc(n2)-c2ccnc(NCCc3cnc[nH]3)c2)c1
InChI Key InChIKey=IPWNDJWJXCLYIL-UHFFFAOYSA-N
Data  1 IC50
  Tab Delimited (TSV)   2D SDfile   Computed 3D by Vconf -m prep SDfile
Find this compound or compounds like it in BindingDB:
Activity Spreadsheet -- Enzyme Inhibition Constant Data from BindingDB
Found 1 hit for monomerid = 11322
TargetCasein kinase II subunit alpha(Homo sapiens (Human))
University Of Padova
LigandPNGBDBM11322((3-chloro-phenyl)-(4-{2-[2-(1H-imidazol-4-yl)-ethy...)
Affinity DataIC50:  3.20E+3nMpH: 7.5 T: 2°C. Assay description: In vitro kinase assay using purified enzyme, was incubated at room temperature with substrate, and test compounds in the presence of 100 uM ATP/ [gam...
In DepthDetails ArticlePubMed