BDBM113235 US8633212, 13
SMILES COC1CCC2(Cc3ccc(cc3C22ON(C)C(N)=N2)-c2ccc(F)c(Cl)c2)CC1
InChI Key InChIKey=OVNPMAGYRQDZCZ-UHFFFAOYSA-N
Data  1 IC50
  Tab Delimited (TSV)   2D SDfile   Computed 3D by Vconf -m prep SDfile
Find this compound or compounds like it in BindingDB:
Activity Spreadsheet -- Enzyme Inhibition Constant Data from BindingDB
Found 1 hit for monomerid = 113235
TargetIsoform C of Beta-secretase 1 (BACE-I-457)(Homo sapiens (Human))
Vitae Pharmaceuticals
US Patent
LigandPNGBDBM113235(US8633212, 13)
Affinity DataIC50:  8.80nMpH: 4.5 T: 2°C. Assay description: Inhibitory activity of compounds was assessed by a fluorescence quench assay of BACE activity. The assay was performed at room temperature in 96-well...
Ligand InfoPC cidPC sid
In DepthDetails US Patent