BDBM113236 US10336717, Compound 14::US8633212, 14
SMILES COC1CCC2(Cc3ccc(cc3C22N=C(N)N(C)C2=O)-c2cc(F)cc(Cl)c2)CC1
InChI Key InChIKey=DZNCTCZTABODEP-UHFFFAOYSA-N
Data  2 IC50
  Tab Delimited (TSV)   2D SDfile   Computed 3D by Vconf -m prep SDfile
Find this compound or compounds like it in BindingDB:
Activity Spreadsheet -- Enzyme Inhibition Constant Data from BindingDB
Found 2 hits for monomerid = 113236
TargetBeta-secretase 1(Homo sapiens (Human))
Vitae Pharmaceuticals
US Patent
LigandPNGBDBM113236(US10336717, Compound 14 | US8633212, 14)
Affinity DataIC50:  11.1nM. Assay description: For each compound being tested, the BACE activity was monitored in a fluorescence quenching assay (FRET) using the ectodomain of BACE (aa 1-454) fuse...
In DepthDetails US Patent
TargetIsoform C of Beta-secretase 1 (BACE-I-457)(Homo sapiens (Human))
Vitae Pharmaceuticals
US Patent
LigandPNGBDBM113236(US10336717, Compound 14 | US8633212, 14)
Affinity DataIC50:  11.1nMpH: 4.5 T: 2°C. Assay description: Inhibitory activity of compounds was assessed by a fluorescence quench assay of BACE activity. The assay was performed at room temperature in 96-well...
In DepthDetails US Patent