BDBM113258 US10336717, Compound 36::US8633212, 36::US9212153, 36
SMILES CN1OC2(N=C1N)c1cc(ccc1CC21CCOc2ccccc2C1)-c1cccc(c1)C#N
InChI Key InChIKey=NNHCQEPHZJRECK-UHFFFAOYSA-N
Data  3 IC50
  Tab Delimited (TSV)   2D SDfile   Computed 3D by Vconf -m prep SDfile
Find this compound or compounds like it in BindingDB:
Activity Spreadsheet -- Enzyme Inhibition Constant Data from BindingDB
Found 3 hits for monomerid = 113258
TargetIsoform C of Beta-secretase 1 (BACE-I-457)(Homo sapiens (Human))
Vitae Pharmaceuticals
US Patent
LigandPNGBDBM113258(US10336717, Compound 36 | US8633212, 36 | US921215...)
Affinity DataIC50:  122nMpH: 4.5 T: 2°C. Assay description: Inhibitory activity of compounds was assessed by a fluorescence quench assay of BACE activity. The assay was performed at room temperature in 96-well...
In DepthDetails US Patent
TargetBeta-secretase 1(Homo sapiens (Human))
Vitae Pharmaceuticals
US Patent
LigandPNGBDBM113258(US10336717, Compound 36 | US8633212, 36 | US921215...)
Affinity DataIC50:  122nM. Assay description: For each compound being tested, the BACE activity was monitored in a fluorescence quenching assay (FRET) using the ectodomain of BACE (aa 1-454) fuse...
In DepthDetails US Patent
TargetBeta-secretase 1 [1-458](Homo sapiens (Human))
Vitae Pharmaceuticals
US Patent
LigandPNGBDBM113258(US10336717, Compound 36 | US8633212, 36 | US921215...)
Affinity DataIC50:  122nMpH: 4.5 T: 2°C. Assay description: Inhibitory activity of compounds was assessed by a fluorescence quench assay of BACE activity using commercially available substrate HiLyte Fluor 488...
In DepthDetails US Patent