BDBM113287 US10336717, Compound 65::US8633212, 65::US9212153, 65
SMILES CO[C@H]1CC[C@]2(Cc3ccc(cc3C22CC(=O)N(C)C(N)=N2)-c2cccc(c2)C#N)CC1
InChI Key InChIKey=PFWUIIHFJCWRDR-OILLYGADSA-N
Data  3 IC50
  Tab Delimited (TSV)   2D SDfile   Computed 3D by Vconf -m prep SDfile
Find this compound or compounds like it in BindingDB:
Activity Spreadsheet -- Enzyme Inhibition Constant Data from BindingDB
Found 3 hits for monomerid = 113287
TargetIsoform C of Beta-secretase 1 (BACE-I-457)(Homo sapiens (Human))
Vitae Pharmaceuticals
US Patent
LigandPNGBDBM113287(US10336717, Compound 65 | US8633212, 65 | US921215...)
Affinity DataIC50:  5.00E+4nMpH: 4.5 T: 2°C. Assay description: Inhibitory activity of compounds was assessed by a fluorescence quench assay of BACE activity. The assay was performed at room temperature in 96-well...
In DepthDetails US Patent
TargetBeta-secretase 1(Homo sapiens (Human))
Vitae Pharmaceuticals
US Patent
LigandPNGBDBM113287(US10336717, Compound 65 | US8633212, 65 | US921215...)
Affinity DataIC50:  5.00E+4nM. Assay description: For each compound being tested, the BACE activity was monitored in a fluorescence quenching assay (FRET) using the ectodomain of BACE (aa 1-454) fuse...
In DepthDetails US Patent
TargetBeta-secretase 1 [1-458](Homo sapiens (Human))
Vitae Pharmaceuticals
US Patent
LigandPNGBDBM113287(US10336717, Compound 65 | US8633212, 65 | US921215...)
Affinity DataIC50:  5.00E+4nMpH: 4.5 T: 2°C. Assay description: Inhibitory activity of compounds was assessed by a fluorescence quench assay of BACE activity using commercially available substrate HiLyte Fluor 488...
In DepthDetails US Patent