BDBM113428 US8633204, 127
SMILES Cc1nc(N)nc2n(C3CCCC3)c(=O)c(cc12)-c1cnc2[nH]ccc2c1
InChI Key InChIKey=VKLCNDBSPMJIHO-UHFFFAOYSA-N
Data  1 IC50
  Tab Delimited (TSV)   2D SDfile   Computed 3D by Vconf -m prep SDfile
Find this compound or compounds like it in BindingDB:
Activity Spreadsheet -- Enzyme Inhibition Constant Data from BindingDB
Found 1 hit for monomerid = 113428
LigandPNGBDBM113428(US8633204, 127)
Affinity DataIC50:  0.480nMpH: 7.4 T: 2°C. Assay description: Compounds of the present invention were evaluated for potency against PI3-Kα using an in vitro kinase assay. PI3-Kα activity is measured in...
In DepthDetails US Patent