BDBM113431 US8633204, 134
SMILES CNc1nc(C)c2cc(-c3ncccc3F)c(=O)n(C3CCCC3)c2n1
InChI Key InChIKey=UKLLNDPYPZWGAU-UHFFFAOYSA-N
Data  1 IC50
  Tab Delimited (TSV)   2D SDfile   Computed 3D by Vconf -m prep SDfile
Find this compound or compounds like it in BindingDB:
Activity Spreadsheet -- Enzyme Inhibition Constant Data from BindingDB
Found 1 hit for monomerid = 113431
LigandPNGBDBM113431(US8633204, 134)
Affinity DataIC50:  2.10E+3nMpH: 7.4 T: 2°C. Assay description: Compounds of the present invention were evaluated for potency against PI3-Kα using an in vitro kinase assay. PI3-Kα activity is measured in...
In DepthDetails US Patent