BDBM113472 US8633204, 183
SMILES CO[C@H]1CC[C@@H](CC1)n1c2nc(N)nc(C)c2cc(-c2cn[nH]c2)c1=O
InChI Key InChIKey=MSWXKPHFXJRTLF-JOCQHMNTSA-N
Data  1 IC50
  Tab Delimited (TSV)   2D SDfile   Computed 3D by Vconf -m prep SDfile
Find this compound or compounds like it in BindingDB:
Activity Spreadsheet -- Enzyme Inhibition Constant Data from BindingDB
Found 1 hit for monomerid = 113472
LigandPNGBDBM113472(US8633204, 183)
Affinity DataIC50:  9nMpH: 7.4 T: 2°C. Assay description: Compounds of the present invention were evaluated for potency against PI3-Kα using an in vitro kinase assay. PI3-Kα activity is measured in...
In DepthDetails US Patent