BDBM113478 US8633204, 190
SMILES Cc1nc(N)nc2n([C@H]3CC[C@H](O)CC3)c(=O)c(cc12)-c1ccc(nc1)C#N
InChI Key InChIKey=HHWCQEVRICETMG-SHTZXODSSA-N
Data  1 IC50
  Tab Delimited (TSV)   2D SDfile   Computed 3D by Vconf -m prep SDfile
Find this compound or compounds like it in BindingDB:
Activity Spreadsheet -- Enzyme Inhibition Constant Data from BindingDB
Found 1 hit for monomerid = 113478
LigandPNGBDBM113478(US8633204, 190)
Affinity DataIC50:  470nMpH: 7.4 T: 2°C. Assay description: Compounds of the present invention were evaluated for potency against PI3-Kα using an in vitro kinase assay. PI3-Kα activity is measured in...
In DepthDetails US Patent