BDBM113493 US8633204, 215
SMILES CNc1nc(C)c2cc(-c3cn[nH]c3)c(=O)n(CC3CCOC3)c2n1
InChI Key InChIKey=GYIJGOOAZHHYFF-UHFFFAOYSA-N
Data  1 IC50
  Tab Delimited (TSV)   2D SDfile   Computed 3D by Vconf -m prep SDfile
Find this compound or compounds like it in BindingDB:
Activity Spreadsheet -- Enzyme Inhibition Constant Data from BindingDB
Found 1 hit for monomerid = 113493
LigandPNGBDBM113493(US8633204, 215)
Affinity DataIC50:  6nMpH: 7.4 T: 2°C. Assay description: Compounds of the present invention were evaluated for potency against PI3-Kα using an in vitro kinase assay. PI3-Kα activity is measured in...
In DepthDetails US Patent