BDBM11355 Hydroxamate 36::N-hydroxy-2-[(4-methoxybenzene)[(4-nitrophenyl)methyl]sulfonamido]acetamide
SMILES COc1ccc(cc1)S(=O)(=O)N(CC(=O)NO)Cc1ccc(cc1)N(=O)=O
InChI Key InChIKey=LOYIGNDQOZNJNZ-UHFFFAOYSA-N
Data  8 KI
  Tab Delimited (TSV)   2D SDfile   Computed 3D by Vconf -m prep SDfile
Find this compound or compounds like it in BindingDB:
Activity Spreadsheet -- Enzyme Inhibition Constant Data from BindingDB
Found 8 hits for monomerid = 11355
Target72 kDa type IV collagenase(Homo sapiens (Human))
Universita Degli Studi
LigandPNGBDBM11355(Hydroxamate 36 | N-hydroxy-2-[(4-methoxybenzene)[(...)
Affinity DataKi:  18nM. Assay description: Initial rates for the hydrolysis of the thioester substrate AcProLeuGly-S-LeuLeuGlyOEt, coupled to the reaction with 5,5-dithiobis(2-nitrobenzoic aci...
In DepthDetails ArticlePubMed
TargetCollagenase ColG(Clostridium histolyticum)
Universita Degli Studi
LigandPNGBDBM11355(Hydroxamate 36 | N-hydroxy-2-[(4-methoxybenzene)[(...)
Affinity DataKi:  20nM. Assay description: The rate of hydrolysis was determined from the change in absorbance at 324 nm using an extinction coefficient, 24700 M-1 cm-1 for FALGPA. Initial vel...
In DepthDetails ArticlePubMed
TargetNeutrophil collagenase(Homo sapiens (Human))
Universita Degli Studi
LigandPNGBDBM11355(Hydroxamate 36 | N-hydroxy-2-[(4-methoxybenzene)[(...)
Affinity DataKi:  21nM. Assay description: Initial rates for the hydrolysis of the thioester substrate AcProLeuGly-S-LeuLeuGlyOEt, coupled to the reaction with 5,5-dithiobis(2-nitrobenzoic aci...
In DepthDetails ArticlePubMed
TargetInterstitial collagenase(Homo sapiens (Human))
Universita Degli Studi
LigandPNGBDBM11355(Hydroxamate 36 | N-hydroxy-2-[(4-methoxybenzene)[(...)
Affinity DataKi:  28nM. Assay description: Initial rates for the hydrolysis of the thioester substrate AcProLeuGly-S-LeuLeuGlyOEt, coupled to the reaction with 5,5-dithiobis(2-nitrobenzoic aci...
In DepthDetails ArticlePubMed
TargetMatrix metalloproteinase-9(Homo sapiens (Human))
Universita Degli Studi
LigandPNGBDBM11355(Hydroxamate 36 | N-hydroxy-2-[(4-methoxybenzene)[(...)
Affinity DataKi:  31nM. Assay description: Initial rates for the hydrolysis of the thioester substrate AcProLeuGly-S-LeuLeuGlyOEt, coupled to the reaction with 5,5-dithiobis(2-nitrobenzoic aci...
In DepthDetails ArticlePubMed
TargetCarbonic anhydrase 2(Homo sapiens (Human))
Universita Degli Studi
LigandPNGBDBM11355(Hydroxamate 36 | N-hydroxy-2-[(4-methoxybenzene)[(...)
Affinity DataKi: >200nM. Assay description: Initial rates of 4-nitrophenyl acetate hydrolysis catalyzed by different CA isozymes were monitored spectrophotometrically at 400 nm. A molar absorpt...
In DepthDetails ArticlePubMed
TargetCarbonic anhydrase 1(Homo sapiens (Human))
Universita Degli Studi
LigandPNGBDBM11355(Hydroxamate 36 | N-hydroxy-2-[(4-methoxybenzene)[(...)
Affinity DataKi: >200nM. Assay description: Initial rates of 4-nitrophenyl acetate hydrolysis catalyzed by different CA isozymes were monitored spectrophotometrically at 400 nm. A molar absorpt...
In DepthDetails ArticlePubMed
TargetCarbonic anhydrase 4(Bos taurus (bovine))
Universita Degli Studi
LigandPNGBDBM11355(Hydroxamate 36 | N-hydroxy-2-[(4-methoxybenzene)[(...)
Affinity DataKi: >200nM. Assay description: Initial rates of 4-nitrophenyl acetate hydrolysis catalyzed by different CA isozymes were monitored spectrophotometrically at 400 nm. A molar absorpt...
In DepthDetails ArticlePubMed