BDBM113556 US8633204, 293
SMILES COc1ncc(cn1)-c1cc2c(C)nc(N)nc2n([C@@H]2CC[C@@H](CC2)OCCO)c1=O
InChI Key InChIKey=PDCGXSKEKLYDRP-GASCZTMLSA-N
Data  1 IC50
  Tab Delimited (TSV)   2D SDfile   Computed 3D by Vconf -m prep SDfile
Find this compound or compounds like it in BindingDB:
Activity Spreadsheet -- Enzyme Inhibition Constant Data from BindingDB
Found 1 hit for monomerid = 113556
LigandPNGBDBM113556(US8633204, 293)
Affinity DataIC50:  5.31nMpH: 7.4 T: 2°C. Assay description: Compounds of the present invention were evaluated for potency against PI3-Kα using an in vitro kinase assay. PI3-Kα activity is measured in...
In DepthDetails US Patent