BDBM11358 (2S)-N-hydroxy-2-[(4-methoxybenzene)[(2-nitrophenyl)methyl]sulfonamido]propanamide::Hydroxamate 39::N-4-Methoxyphenylsulfonyl-N-2-nitrobenzyl-L-alanine hydroxamate
SMILES COc1ccc(cc1)S(=O)(=O)N(Cc1ccccc1[N+]([O-])=O)[C@@H](C)C(=O)NO
InChI Key InChIKey=XVUIGVGFVWRFJO-LBPRGKRZSA-N
Data  8 KI
  Tab Delimited (TSV)   2D SDfile   Computed 3D by Vconf -m prep SDfile
Find this compound or compounds like it in BindingDB:
Activity Spreadsheet -- Enzyme Inhibition Constant Data from BindingDB
Found 8 hits for monomerid = 11358
Target72 kDa type IV collagenase(Homo sapiens (Human))
Universita Degli Studi
LigandPNGBDBM11358((2S)-N-hydroxy-2-[(4-methoxybenzene)[(2-nitropheny...)
Affinity DataKi:  13nM. Assay description: Initial rates for the hydrolysis of the thioester substrate AcProLeuGly-S-LeuLeuGlyOEt, coupled to the reaction with 5,5-dithiobis(2-nitrobenzoic aci...
In DepthDetails ArticlePubMed
TargetCollagenase ColG(Clostridium histolyticum)
Universita Degli Studi
LigandPNGBDBM11358((2S)-N-hydroxy-2-[(4-methoxybenzene)[(2-nitropheny...)
Affinity DataKi:  19nM. Assay description: The rate of hydrolysis was determined from the change in absorbance at 324 nm using an extinction coefficient, 24700 M-1 cm-1 for FALGPA. Initial vel...
In DepthDetails ArticlePubMed
TargetNeutrophil collagenase(Homo sapiens (Human))
Universita Degli Studi
LigandPNGBDBM11358((2S)-N-hydroxy-2-[(4-methoxybenzene)[(2-nitropheny...)
Affinity DataKi:  20nM. Assay description: Initial rates for the hydrolysis of the thioester substrate AcProLeuGly-S-LeuLeuGlyOEt, coupled to the reaction with 5,5-dithiobis(2-nitrobenzoic aci...
In DepthDetails ArticlePubMed
TargetMatrix metalloproteinase-9(Homo sapiens (Human))
Universita Degli Studi
LigandPNGBDBM11358((2S)-N-hydroxy-2-[(4-methoxybenzene)[(2-nitropheny...)
Affinity DataKi:  24nM. Assay description: Initial rates for the hydrolysis of the thioester substrate AcProLeuGly-S-LeuLeuGlyOEt, coupled to the reaction with 5,5-dithiobis(2-nitrobenzoic aci...
In DepthDetails ArticlePubMed
TargetInterstitial collagenase(Homo sapiens (Human))
Universita Degli Studi
LigandPNGBDBM11358((2S)-N-hydroxy-2-[(4-methoxybenzene)[(2-nitropheny...)
Affinity DataKi:  39nM. Assay description: Initial rates for the hydrolysis of the thioester substrate AcProLeuGly-S-LeuLeuGlyOEt, coupled to the reaction with 5,5-dithiobis(2-nitrobenzoic aci...
In DepthDetails ArticlePubMed
TargetCarbonic anhydrase 2(Homo sapiens (Human))
Universita Degli Studi
LigandPNGBDBM11358((2S)-N-hydroxy-2-[(4-methoxybenzene)[(2-nitropheny...)
Affinity DataKi: >200nM. Assay description: Initial rates of 4-nitrophenyl acetate hydrolysis catalyzed by different CA isozymes were monitored spectrophotometrically at 400 nm. A molar absorpt...
In DepthDetails ArticlePubMed
TargetCarbonic anhydrase 1(Homo sapiens (Human))
Universita Degli Studi
LigandPNGBDBM11358((2S)-N-hydroxy-2-[(4-methoxybenzene)[(2-nitropheny...)
Affinity DataKi: >200nM. Assay description: Initial rates of 4-nitrophenyl acetate hydrolysis catalyzed by different CA isozymes were monitored spectrophotometrically at 400 nm. A molar absorpt...
In DepthDetails ArticlePubMed
TargetCarbonic anhydrase 4(Bos taurus (bovine))
Universita Degli Studi
LigandPNGBDBM11358((2S)-N-hydroxy-2-[(4-methoxybenzene)[(2-nitropheny...)
Affinity DataKi: >200nM. Assay description: Initial rates of 4-nitrophenyl acetate hydrolysis catalyzed by different CA isozymes were monitored spectrophotometrically at 400 nm. A molar absorpt...
In DepthDetails ArticlePubMed