BDBM11380 Hydroxysulfonamide 61::N-hydroxy-2-nitrobenzene-1-sulfonamide
SMILES ONS(=O)(=O)c1ccccc1N(=O)=O
InChI Key InChIKey=CDRGZNIXJYUKQP-UHFFFAOYSA-N
Data  8 KI
  Tab Delimited (TSV)   2D SDfile   Computed 3D by Vconf -m prep SDfile
Find this compound or compounds like it in BindingDB:
Activity Spreadsheet -- Enzyme Inhibition Constant Data from BindingDB
Found 8 hits for monomerid = 11380
TargetCarbonic anhydrase 2(Homo sapiens (Human))
Universita Degli Studi
LigandPNGBDBM11380(Hydroxysulfonamide 61 | N-hydroxy-2-nitrobenzene-1...)
Affinity DataKi:  5nM. Assay description: Initial rates of 4-nitrophenyl acetate hydrolysis catalyzed by different CA isozymes were monitored spectrophotometrically at 400 nm. A molar absorpt...
In DepthDetails ArticlePubMed
TargetCarbonic anhydrase 4(Bos taurus (bovine))
Universita Degli Studi
LigandPNGBDBM11380(Hydroxysulfonamide 61 | N-hydroxy-2-nitrobenzene-1...)
Affinity DataKi:  13nM. Assay description: Initial rates of 4-nitrophenyl acetate hydrolysis catalyzed by different CA isozymes were monitored spectrophotometrically at 400 nm. A molar absorpt...
In DepthDetails ArticlePubMed
TargetCarbonic anhydrase 1(Homo sapiens (Human))
Universita Degli Studi
LigandPNGBDBM11380(Hydroxysulfonamide 61 | N-hydroxy-2-nitrobenzene-1...)
Affinity DataKi:  1.50E+4nM. Assay description: Initial rates of 4-nitrophenyl acetate hydrolysis catalyzed by different CA isozymes were monitored spectrophotometrically at 400 nm. A molar absorpt...
In DepthDetails ArticlePubMed
TargetMatrix metalloproteinase-9(Homo sapiens (Human))
Universita Degli Studi
LigandPNGBDBM11380(Hydroxysulfonamide 61 | N-hydroxy-2-nitrobenzene-1...)
Affinity DataKi:  2.30E+4nM. Assay description: Initial rates for the hydrolysis of the thioester substrate AcProLeuGly-S-LeuLeuGlyOEt, coupled to the reaction with 5,5-dithiobis(2-nitrobenzoic aci...
In DepthDetails ArticlePubMed
TargetNeutrophil collagenase(Homo sapiens (Human))
Universita Degli Studi
LigandPNGBDBM11380(Hydroxysulfonamide 61 | N-hydroxy-2-nitrobenzene-1...)
Affinity DataKi:  2.40E+4nM. Assay description: Initial rates for the hydrolysis of the thioester substrate AcProLeuGly-S-LeuLeuGlyOEt, coupled to the reaction with 5,5-dithiobis(2-nitrobenzoic aci...
In DepthDetails ArticlePubMed
Target72 kDa type IV collagenase(Homo sapiens (Human))
Universita Degli Studi
LigandPNGBDBM11380(Hydroxysulfonamide 61 | N-hydroxy-2-nitrobenzene-1...)
Affinity DataKi:  3.80E+4nM. Assay description: Initial rates for the hydrolysis of the thioester substrate AcProLeuGly-S-LeuLeuGlyOEt, coupled to the reaction with 5,5-dithiobis(2-nitrobenzoic aci...
In DepthDetails ArticlePubMed
TargetInterstitial collagenase(Homo sapiens (Human))
Universita Degli Studi
LigandPNGBDBM11380(Hydroxysulfonamide 61 | N-hydroxy-2-nitrobenzene-1...)
Affinity DataKi:  5.90E+4nM. Assay description: Initial rates for the hydrolysis of the thioester substrate AcProLeuGly-S-LeuLeuGlyOEt, coupled to the reaction with 5,5-dithiobis(2-nitrobenzoic aci...
In DepthDetails ArticlePubMed
TargetCollagenase ColG(Clostridium histolyticum)
Universita Degli Studi
LigandPNGBDBM11380(Hydroxysulfonamide 61 | N-hydroxy-2-nitrobenzene-1...)
Affinity DataKi:  6.20E+4nM. Assay description: The rate of hydrolysis was determined from the change in absorbance at 324 nm using an extinction coefficient, 24700 M-1 cm-1 for FALGPA. Initial vel...
In DepthDetails ArticlePubMed