BDBM113935 1-(4-fluorophenyl)-3-[(2S,3R)-3-methyl-2-[[methyl-[(4-phenoxyphenyl)methyl]amino]methyl]-6-oxidanylidene-5-[(2S)-1-oxidanylpropan-2-yl]-3,4-dihydro-2H-1,5-benzoxazocin-8-yl]urea::1-(4-fluorophenyl)-3-[(2S,3R)-5-[(1S)-2-hydroxy-1-methyl-ethyl]-6-keto-3-methyl-2-[[methyl-(4-phenoxybenzyl)amino]methyl]-3,4-dihydro-2H-1,5-benzoxazocin-8-yl]urea::1-(4-fluorophenyl)-3-[(2S,3R)-5-[(2S)-1-hydroxypropan-2-yl]-3-methyl-2-[[methyl-[(4-phenoxyphenyl)methyl]amino]methyl]-6-oxo-3,4-dihydro-2H-1,5-benzoxazocin-8-yl]urea::MLS002474342::SMR001398503::cid_44201997
SMILES C[C@@H](CO)N1C[C@@H](C)[C@@H](CN(C)Cc2ccc(Oc3ccccc3)cc2)Oc2ccc(NC(=O)Nc3ccc(F)cc3)cc2C1=O
InChI Key InChIKey=NOWHXTYRWKQEBH-RDXDNIQESA-N
Data  2 IC50
  Tab Delimited (TSV)   2D SDfile   Computed 3D by Vconf -m prep SDfile
Find this compound or compounds like it in BindingDB:
Activity Spreadsheet -- Enzyme Inhibition Constant Data from BindingDB
Found 2 hits for monomerid = 113935
TargetDisintegrin and metalloproteinase domain-containing protein 10(Homo sapiens (Human))
The Scripps Research Institute Molecular Screening Center
Curated by PubChem BioAssay
LigandPNGBDBM113935(1-(4-fluorophenyl)-3-[(2S,3R)-3-methyl-2-[[methyl-...)
Affinity DataIC50:  2.58E+3nM. Assay description: Source (MLPCN Center Name): The Scripps Research Institute Molecular Screening Center (SRIMSC) Center Affiliation: Torrey Pines Institute for Molecul...
In DepthDetails PCBioAssay
TargetDisintegrin and metalloproteinase domain-containing protein 17(Homo sapiens (Human))
The Scripps Research Institute Molecular Screening Center
Curated by PubChem BioAssay
LigandPNGBDBM113935(1-(4-fluorophenyl)-3-[(2S,3R)-3-methyl-2-[[methyl-...)
Affinity DataIC50:  6.95E+4nM. Assay description: Source (MLPCN Center Name): The Scripps Research Institute Molecular Screening Center (SRIMSC) Center Affiliation: Torrey Pines Institute for Molecul...
In DepthDetails PCBioAssay