BDBM114085 4-methoxy-N-(4-phenylazanylphenyl)benzenesulfonamide::MLS001179478::N-(4-anilinophenyl)-4-methoxy-benzenesulfonamide::N-(4-anilinophenyl)-4-methoxybenzenesulfonamide::SMR000476739::cid_1011074
SMILES COc1ccc(cc1)S(=O)(=O)Nc1ccc(Nc2ccccc2)cc1
InChI Key InChIKey=MKFDTMOSDYAIGN-UHFFFAOYSA-N
Data  2 IC50
  Tab Delimited (TSV)   2D SDfile   Computed 3D by Vconf -m prep SDfile
Find this compound or compounds like it in BindingDB:
Activity Spreadsheet -- Enzyme Inhibition Constant Data from BindingDB
Found 2 hits for monomerid = 114085
TargetDisintegrin and metalloproteinase domain-containing protein 17(Homo sapiens (Human))
The Scripps Research Institute Molecular Screening Center
Curated by PubChem BioAssay
LigandPNGBDBM114085(4-methoxy-N-(4-phenylazanylphenyl)benzenesulfonami...)
Affinity DataIC50:  6.95E+4nM. Assay description: Source (MLPCN Center Name): The Scripps Research Institute Molecular Screening Center (SRIMSC) Center Affiliation: Torrey Pines Institute for Molecul...
In DepthDetails PCBioAssay
TargetDisintegrin and metalloproteinase domain-containing protein 10(Homo sapiens (Human))
The Scripps Research Institute Molecular Screening Center
Curated by PubChem BioAssay
LigandPNGBDBM114085(4-methoxy-N-(4-phenylazanylphenyl)benzenesulfonami...)
Affinity DataIC50:  1.20E+4nM. Assay description: Source (MLPCN Center Name): The Scripps Research Institute Molecular Screening Center (SRIMSC) Center Affiliation: Torrey Pines Institute for Molecul...
In DepthDetails PCBioAssay