BDBM114087 3-(5,6-Dichloro-2-{1-[4-(4-fluoro-phenyl)-thiazol-2-yl]-pyrrolidin-2-yl}-benzoimidazol-1-yl)-propan-1-ol::3-[5,6-bis(chloranyl)-2-[1-[4-(4-fluorophenyl)-1,3-thiazol-2-yl]pyrrolidin-2-yl]benzimidazol-1-yl]propan-1-ol::3-[5,6-dichloro-2-[1-[4-(4-fluorophenyl)-1,3-thiazol-2-yl]pyrrolidin-2-yl]benzimidazol-1-yl]propan-1-ol::3-[5,6-dichloro-2-[1-[4-(4-fluorophenyl)-2-thiazolyl]-2-pyrrolidinyl]-1-benzimidazolyl]-1-propanol::3-[5,6-dichloro-2-[1-[4-(4-fluorophenyl)thiazol-2-yl]pyrrolidin-2-yl]benzimidazol-1-yl]propan-1-ol::MLS000911824::SMR000478101::cid_23724115
SMILES OCCCn1c(nc2cc(Cl)c(Cl)cc12)C1CCCN1c1nc(cs1)-c1ccc(F)cc1
InChI Key InChIKey=GLVWXUSKTSISSX-UHFFFAOYSA-N
Data  2 IC50
  Tab Delimited (TSV)   2D SDfile   Computed 3D by Vconf -m prep SDfile
Find this compound or compounds like it in BindingDB:
Activity Spreadsheet -- Enzyme Inhibition Constant Data from BindingDB
Found 2 hits for monomerid = 114087
TargetDisintegrin and metalloproteinase domain-containing protein 17(Homo sapiens (Human))
The Scripps Research Institute Molecular Screening Center
Curated by PubChem BioAssay
LigandPNGBDBM114087(3-(5,6-Dichloro-2-{1-[4-(4-fluoro-phenyl)-thiazol-...)
Affinity DataIC50:  6.95E+4nM. Assay description: Source (MLPCN Center Name): The Scripps Research Institute Molecular Screening Center (SRIMSC) Center Affiliation: Torrey Pines Institute for Molecul...
In DepthDetails PCBioAssay
TargetDisintegrin and metalloproteinase domain-containing protein 10(Homo sapiens (Human))
The Scripps Research Institute Molecular Screening Center
Curated by PubChem BioAssay
LigandPNGBDBM114087(3-(5,6-Dichloro-2-{1-[4-(4-fluoro-phenyl)-thiazol-...)
Affinity DataIC50:  6.95E+4nM. Assay description: Source (MLPCN Center Name): The Scripps Research Institute Molecular Screening Center (SRIMSC) Center Affiliation: Torrey Pines Institute for Molecul...
In DepthDetails PCBioAssay