BDBM114256 4-amino-N-cyclohexyl-2-(methylthio)-5-thiazolecarboxamide::4-amino-N-cyclohexyl-2-(methylthio)thiazole-5-carboxamide::4-amino-N-cyclohexyl-2-methylsulfanyl-1,3-thiazole-5-carboxamide::4-azanyl-N-cyclohexyl-2-methylsulfanyl-1,3-thiazole-5-carboxamide::MLS000757085::SMR000528890::cid_325654
SMILES CSc1nc(N)c(s1)C(=O)NC1CCCCC1
InChI Key InChIKey=SSWSSIPGSCCEGC-UHFFFAOYSA-N
Data  2 IC50
  Tab Delimited (TSV)   2D SDfile   Computed 3D by Vconf -m prep SDfile
Find this compound or compounds like it in BindingDB:
Activity Spreadsheet -- Enzyme Inhibition Constant Data from BindingDB
Found 2 hits for monomerid = 114256
Target1-phosphatidylinositol 4,5-bisphosphate phosphodiesterase beta-3(Homo sapiens (Human))
The Scripps Research Institute Molecular Screening Center
Curated by PubChem BioAssay
LigandPNGBDBM114256(4-amino-N-cyclohexyl-2-(methylthio)-5-thiazolecarb...)
Affinity DataIC50:  1.23E+5nM. Assay description: Source (MLPCN Center Name): The Scripps Research Institute Molecular Screening Center (SRIMSC) Center Affiliation: The Scripps Research Institute Ass...
Ligand InfoPC cidPC sid
In DepthDetails PCBioAssay
Target1-phosphatidylinositol 4,5-bisphosphate phosphodiesterase gamma-1 [1-999,I813T](Homo sapiens (Human))
The Scripps Research Institute Molecular Screening Center
Curated by PubChem BioAssay
LigandPNGBDBM114256(4-amino-N-cyclohexyl-2-(methylthio)-5-thiazolecarb...)
Affinity DataIC50:  1.23E+5nM. Assay description: Source (MLPCN Center Name): The Scripps Research Institute Molecular Screening Center (SRIMSC) Center Affiliation: The Scripps Research Institute Ass...
Ligand InfoPC cidPC sid
In DepthDetails PCBioAssay