BDBM114272 1,1-bis(oxidanylidene)-4H-1,4-benzothiazin-3-one::1,1-diketo-4H-1,4-benzothiazin-3-one::1,1-dioxo-4H-1,4-benzothiazin-3-one::1lambda~6~,4-benzothiazine-1,1,3(2H,4H)-trione::MLS001195366::SMR000550588::cid_1490926
SMILES O=C1CS(=O)(=O)c2ccccc2N1
InChI Key InChIKey=YIWUEDSIYPTYEF-UHFFFAOYSA-N
Data  2 IC50
  Tab Delimited (TSV)   2D SDfile   Computed 3D by Vconf -m prep SDfile
Find this compound or compounds like it in BindingDB:
Activity Spreadsheet -- Enzyme Inhibition Constant Data from BindingDB
Found 2 hits for monomerid = 114272
Target1-phosphatidylinositol 4,5-bisphosphate phosphodiesterase beta-3(Homo sapiens (Human))
The Scripps Research Institute Molecular Screening Center
Curated by PubChem BioAssay
LigandPNGBDBM114272(1,1-bis(oxidanylidene)-4H-1,4-benzothiazin-3-one |...)
Affinity DataIC50:  1.23E+5nM. Assay description: Source (MLPCN Center Name): The Scripps Research Institute Molecular Screening Center (SRIMSC) Center Affiliation: The Scripps Research Institute Ass...
In DepthDetails PCBioAssay
Target1-phosphatidylinositol 4,5-bisphosphate phosphodiesterase gamma-1 [1-999,I813T](Homo sapiens (Human))
The Scripps Research Institute Molecular Screening Center
Curated by PubChem BioAssay
LigandPNGBDBM114272(1,1-bis(oxidanylidene)-4H-1,4-benzothiazin-3-one |...)
Affinity DataIC50:  3.57E+4nM. Assay description: Source (MLPCN Center Name): The Scripps Research Institute Molecular Screening Center (SRIMSC) Center Affiliation: The Scripps Research Institute Ass...
In DepthDetails PCBioAssay