BDBM114314 6,8-bis(bromanyl)-3-methoxy-2-methyl-quinoline::6,8-dibromo-3-methoxy-2-methyl-quinoline::6,8-dibromo-3-methoxy-2-methylquinoline::MLS000541356::SMR000126214::cid_1473006
SMILES COc1cc2cc(Br)cc(Br)c2nc1C
InChI Key InChIKey=FCFSZNPPKZCVRS-UHFFFAOYSA-N
Data  1 IC50
  Tab Delimited (TSV)   2D SDfile   Computed 3D by Vconf -m prep SDfile
Find this compound or compounds like it in BindingDB:
Activity Spreadsheet -- Enzyme Inhibition Constant Data from BindingDB
Found 1 hit for monomerid = 114314
TargetMajor prion protein(Homo sapiens (Human))
The Scripps Research Institute Molecular Screening Center
Curated by PubChem BioAssay
LigandPNGBDBM114314(6,8-bis(bromanyl)-3-methoxy-2-methyl-quinoline | 6...)
Affinity DataIC50:  4.51E+3nM. Assay description: Source (MLPCN Center Name): The Scripps Research Institute Molecular Screening Center (SRIMSC) Affiliation: The Scripps Research Institute, TSRI Assa...
In DepthDetails PCBioAssay