BDBM11450 4-({5-[(4-hydroxycyclohexyl)amino]-[1,2,4]triazolo[1,5-a]pyrimidin-7-yl}amino)benzene-1-sulfonamide::triazolo[1,5-a]pyrimidine 12
SMILES NS(=O)(=O)c1ccc(Nc2cc(N[C@H]3CC[C@H](O)CC3)nc3ncnn23)cc1
InChI Key InChIKey=ZXJZXTATRONGHN-AULYBMBSSA-N
Data  1 IC50
  Tab Delimited (TSV)   2D SDfile   Computed 3D by Vconf -m prep SDfile
Find this compound or compounds like it in BindingDB:
Activity Spreadsheet -- Enzyme Inhibition Constant Data from BindingDB
Found 1 hit for monomerid = 11450
TargetCyclin-A2/Cyclin-dependent kinase 2(Homo sapiens (Human))
Vernalis (R&D)
LigandPNGBDBM11450(4-({5-[(4-hydroxycyclohexyl)amino]-[1,2,4]triazolo...)
Affinity DataIC50:  7.40E+3nMpH: 7.5 T: 2°C. Assay description: In vitro kinase assay using purified CDK enzyme was incubated at room temperature with substrate, and test compounds in the presence of 100 uM ATP/ [...
In DepthDetails ArticlePubMed