BDBM114666 7,9-diketo-8-methyl-6,11-dihydro-5bH-indolizino[1,2-b]quinoline-8-carboxylic acid ethyl ester::8-methyl-7,9-dioxo-6,11-dihydro-5bH-indolizino[1,2-b]quinoline-8-carboxylic acid ethyl ester::MLS002920754::SMR001798340::cid_288099::ethyl 8-methyl-7,9-bis(oxidanylidene)-6,11-dihydro-5bH-indolizino[1,2-b]quinoline-8-carboxylate::ethyl 8-methyl-7,9-dioxo-6,11-dihydro-5bH-indolizino[1,2-b]quinoline-8-carboxylate
SMILES CCOC(=O)C1(C)C(=O)CC2N(Cc3cc4ccccc4nc23)C1=O
InChI Key InChIKey=OFUJHSIUARGGNL-UHFFFAOYSA-N
Data  2 IC50
  Tab Delimited (TSV)   2D SDfile   Computed 3D by Vconf -m prep SDfile
Find this compound or compounds like it in BindingDB:
Activity Spreadsheet -- Enzyme Inhibition Constant Data from BindingDB
Found 2 hits for monomerid = 114666
TargetFibrinogen beta chain [164-491](Homo sapiens (Human))
The Scripps Research Institute Molecular Screening Center
Curated by PubChem BioAssay
LigandPNGBDBM114666(7,9-diketo-8-methyl-6,11-dihydro-5bH-indolizino[1,...)
Affinity DataIC50:  8.32E+4nM. Assay description: Source (MLPCN Center Name): The Scripps Research Institute Molecular Screening Center (SRIMSC) Center Affiliation: Harvard Medical School/Massachuset...
Ligand InfoPC cidPC sid
In DepthDetails PCBioAssay
TargetFibrinogen beta chain [164-491](Homo sapiens (Human))
The Scripps Research Institute Molecular Screening Center
Curated by PubChem BioAssay
LigandPNGBDBM114666(7,9-diketo-8-methyl-6,11-dihydro-5bH-indolizino[1,...)
Affinity DataIC50:  9.24E+3nM. Assay description: Source (MLPCN Center Name): The Scripps Research Institute Molecular Screening Center (SRIMSC) Center Affiliation: Harvard Medical School/Massachuset...
Ligand InfoPC cidPC sid
In DepthDetails PCBioAssay