BDBM114746 1-(4-methyl-1,3-thiazol-2-yl)-3-(2-nitrophenyl)urea::1-(4-methyl-2-thiazolyl)-3-(2-nitrophenyl)urea::1-(4-methylthiazol-2-yl)-3-(2-nitrophenyl)urea::MLS000672095::N-(4-methyl-1,3-thiazol-2-yl)-N'-(2-nitrophenyl)urea::SMR000293525::cid_2950184
SMILES Cc1csc(NC(=O)Nc2ccccc2[N+]([O-])=O)n1
InChI Key InChIKey=LQYSRVCLRUOTQB-UHFFFAOYSA-N
Data  2 EC50
  Tab Delimited (TSV)   2D SDfile   Computed 3D by Vconf -m prep SDfile
Find this compound or compounds like it in BindingDB:
Activity Spreadsheet -- Enzyme Inhibition Constant Data from BindingDB
Found 2 hits for monomerid = 114746
TargetNuclear hormone receptor family member daf-12(Caenorhabditis elegans)
The Scripps Research Institute Molecular Screening Center
Curated by PubChem BioAssay
LigandPNGBDBM114746(1-(4-methyl-1,3-thiazol-2-yl)-3-(2-nitrophenyl)ure...)
Affinity DataEC50:  6.76E+4nM. Assay description: Source (MLPCN Center Name): The Scripps Research Institute Molecular Screening Center (SRIMSC) Affiliation: The Scripps Research Institute, TSRI Assa...
In DepthDetails PCBioAssay
TargetOxysterols receptor LXR-beta(Homo sapiens (Human))
The Scripps Research Institute Molecular Screening Center
Curated by PubChem BioAssay
LigandPNGBDBM114746(1-(4-methyl-1,3-thiazol-2-yl)-3-(2-nitrophenyl)ure...)
Affinity DataEC50:  6.76E+4nM. Assay description: Source (MLPCN Center Name): The Scripps Research Institute Molecular Screening Center Affiliation: UT Southwestern Assay Provider: David Mangelsdorf,...
In DepthDetails PCBioAssay