BDBM114748 5-(3-methoxyphenyl)-3-(2-thienyl)-1,2,4-oxadiazole::5-(3-methoxyphenyl)-3-thiophen-2-yl-1,2,4-oxadiazole::MLS000674346::SMR000297310::cid_718728
SMILES COc1cccc(c1)-c1nc(no1)-c1cccs1
InChI Key InChIKey=YCPYSZXBSIVBQG-UHFFFAOYSA-N
Data  2 IC50  2 EC50
  Tab Delimited (TSV)   2D SDfile   Computed 3D by Vconf -m prep SDfile
Find this compound or compounds like it in BindingDB:
Activity Spreadsheet -- Enzyme Inhibition Constant Data from BindingDB
Found 4 hits for monomerid = 114748
TargetOxysterols receptor LXR-beta(Homo sapiens (Human))
The Scripps Research Institute Molecular Screening Center
Curated by PubChem BioAssay
LigandPNGBDBM114748(5-(3-methoxyphenyl)-3-(2-thienyl)-1,2,4-oxadiazole...)
Affinity DataEC50:  6.76E+4nM. Assay description: Source (MLPCN Center Name): The Scripps Research Institute Molecular Screening Center Affiliation: UT Southwestern Assay Provider: David Mangelsdorf,...
In DepthDetails PCBioAssay
TargetNuclear hormone receptor family member daf-12(Caenorhabditis elegans)
The Scripps Research Institute Molecular Screening Center
Curated by PubChem BioAssay
LigandPNGBDBM114748(5-(3-methoxyphenyl)-3-(2-thienyl)-1,2,4-oxadiazole...)
Affinity DataIC50:  6.76E+4nM. Assay description: Source (MLPCN Center Name): The Scripps Research Institute Molecular Screening Center Affiliation: UT Southwestern Assay Provider: David Mangelsdorf,...
In DepthDetails PCBioAssay
TargetNuclear hormone receptor family member daf-12(Caenorhabditis elegans)
The Scripps Research Institute Molecular Screening Center
Curated by PubChem BioAssay
LigandPNGBDBM114748(5-(3-methoxyphenyl)-3-(2-thienyl)-1,2,4-oxadiazole...)
Affinity DataEC50:  6.76E+4nM. Assay description: Source (MLPCN Center Name): The Scripps Research Institute Molecular Screening Center (SRIMSC) Affiliation: The Scripps Research Institute, TSRI Assa...
In DepthDetails PCBioAssay
TargetOxysterols receptor LXR-beta(Homo sapiens (Human))
The Scripps Research Institute Molecular Screening Center
Curated by PubChem BioAssay
LigandPNGBDBM114748(5-(3-methoxyphenyl)-3-(2-thienyl)-1,2,4-oxadiazole...)
Affinity DataIC50:  6.76E+4nM. Assay description: Source (MLPCN Center Name): The Scripps Research Institute Molecular Screening Center Affiliation: UT Southwestern Assay Provider: David Mangelsdorf,...
In DepthDetails PCBioAssay