BDBM114816 3-[4-(dimethylamino)phenyl]-2-benzopyran-1-one::3-[4-(dimethylamino)phenyl]isochromen-1-one::3-[4-(dimethylamino)phenyl]isocoumarin::MLS001308081::SMR001216465::cid_25058362
SMILES CN(C)c1ccc(cc1)-c1cc2ccccc2c(=O)o1
InChI Key InChIKey=KMRJHLYHSGQPDJ-UHFFFAOYSA-N
Data  2 EC50
  Tab Delimited (TSV)   2D SDfile   Computed 3D by Vconf -m prep SDfile
Find this compound or compounds like it in BindingDB:
Activity Spreadsheet -- Enzyme Inhibition Constant Data from BindingDB
Found 2 hits for monomerid = 114816
TargetNuclear hormone receptor family member daf-12(Caenorhabditis elegans)
The Scripps Research Institute Molecular Screening Center
Curated by PubChem BioAssay
LigandPNGBDBM114816(3-[4-(dimethylamino)phenyl]-2-benzopyran-1-one | 3...)
Affinity DataEC50:  6.76E+4nM. Assay description: Source (MLPCN Center Name): The Scripps Research Institute Molecular Screening Center (SRIMSC) Affiliation: The Scripps Research Institute, TSRI Assa...
In DepthDetails PCBioAssay
TargetOxysterols receptor LXR-beta(Homo sapiens (Human))
The Scripps Research Institute Molecular Screening Center
Curated by PubChem BioAssay
LigandPNGBDBM114816(3-[4-(dimethylamino)phenyl]-2-benzopyran-1-one | 3...)
Affinity DataEC50:  6.76E+4nM. Assay description: Source (MLPCN Center Name): The Scripps Research Institute Molecular Screening Center Affiliation: UT Southwestern Assay Provider: David Mangelsdorf,...
In DepthDetails PCBioAssay