BDBM114886 5,7-dimethyl-2-phenyl-pyrazolo[1,5-a]pyrimidine::5,7-dimethyl-2-phenylpyrazolo[1,5-a]pyrimidine::MLS000711401::SMR000281168::cid_737207
SMILES Cc1cc(C)n2nc(cc2n1)-c1ccccc1
InChI Key InChIKey=AZWWKRAUFGDLEV-UHFFFAOYSA-N
Data  2 IC50
  Tab Delimited (TSV)   2D SDfile   Computed 3D by Vconf -m prep SDfile
Find this compound or compounds like it in BindingDB:
Activity Spreadsheet -- Enzyme Inhibition Constant Data from BindingDB
Found 2 hits for monomerid = 114886
TargetNuclear hormone receptor family member daf-12(Caenorhabditis elegans)
The Scripps Research Institute Molecular Screening Center
Curated by PubChem BioAssay
LigandPNGBDBM114886(5,7-dimethyl-2-phenyl-pyrazolo[1,5-a]pyrimidine | ...)
Affinity DataIC50:  6.75E+4nM. Assay description: Source (MLPCN Center Name): The Scripps Research Institute Molecular Screening Center Affiliation: UT Southwestern Assay Provider: David Mangelsdorf,...
In DepthDetails PCBioAssay
TargetOxysterols receptor LXR-beta(Homo sapiens (Human))
The Scripps Research Institute Molecular Screening Center
Curated by PubChem BioAssay
LigandPNGBDBM114886(5,7-dimethyl-2-phenyl-pyrazolo[1,5-a]pyrimidine | ...)
Affinity DataIC50:  6.75E+4nM. Assay description: Source (MLPCN Center Name): The Scripps Research Institute Molecular Screening Center Affiliation: UT Southwestern Assay Provider: David Mangelsdorf,...
In DepthDetails PCBioAssay