BDBM115023 3-(2-pyridinyl)-6-(2-pyridinylmethylthio)pyridazine::3-(2-pyridyl)-6-(2-pyridylmethylthio)pyridazine::3-pyridin-2-yl-6-(pyridin-2-ylmethylsulfanyl)pyridazine::MLS000678515::SMR000323987::cid_7162438
SMILES C(Sc1ccc(nn1)-c1ccccn1)c1ccccn1
InChI Key InChIKey=BMHGUWQJWGVXMD-UHFFFAOYSA-N
Data  1 EC50
  Tab Delimited (TSV)   2D SDfile   Computed 3D by Vconf -m prep SDfile
Find this compound or compounds like it in BindingDB:
Activity Spreadsheet -- Enzyme Inhibition Constant Data from BindingDB
Found 1 hit for monomerid = 115023
TargetOxysterols receptor LXR-beta(Homo sapiens (Human))
The Scripps Research Institute Molecular Screening Center
Curated by PubChem BioAssay
LigandPNGBDBM115023(3-(2-pyridinyl)-6-(2-pyridinylmethylthio)pyridazin...)
Affinity DataEC50:  6.75E+4nM. Assay description: Source (MLPCN Center Name): The Scripps Research Institute Molecular Screening Center Affiliation: UT Southwestern Assay Provider: David Mangelsdorf,...
In DepthDetails PCBioAssay