BDBM115047 (4-phenylazophenyl)methanol::(4-phenyldiazenylphenyl)methanol::MLS001180998::SMR000475651::[4-(phenyldiazenyl)phenyl]methanol::cid_555490
SMILES OCc1ccc(cc1)\N=N\c1ccccc1
InChI Key InChIKey=KDTXPUDCLDUROO-CCEZHUSRSA-N
Data  1 EC50
  Tab Delimited (TSV)   2D SDfile   Computed 3D by Vconf -m prep SDfile
Find this compound or compounds like it in BindingDB:
Activity Spreadsheet -- Enzyme Inhibition Constant Data from BindingDB
Found 1 hit for monomerid = 115047
TargetOxysterols receptor LXR-beta(Homo sapiens (Human))
The Scripps Research Institute Molecular Screening Center
Curated by PubChem BioAssay
LigandPNGBDBM115047((4-phenylazophenyl)methanol | (4-phenyldiazenylphe...)
Affinity DataEC50:  6.75E+4nM. Assay description: Source (MLPCN Center Name): The Scripps Research Institute Molecular Screening Center Affiliation: UT Southwestern Assay Provider: David Mangelsdorf,...
In DepthDetails PCBioAssay