BDBM11509 (2S,3S)-1-[(3S)-3-fluoropyrrolidin-1-yl]-3-[4-(4-methanesulfonamidophenyl)phenyl]-1-oxobutan-2-aminium; 2,2,2-trifluoroacetate::3-(S)-fluoropyrrolidide 29
SMILES C[C@H]([C@H]([NH3+])C(=O)N1CC[C@H](F)C1)c1ccc(cc1)-c1ccc(NS(C)(=O)=O)cc1
InChI Key InChIKey=ZNNGBMRCXOODQI-DCPHZVHLSA-O
Data  4 IC50
  Tab Delimited (TSV)   2D SDfile   Computed 3D by Vconf -m prep SDfile
Find this compound or compounds like it in BindingDB:
Activity Spreadsheet -- Enzyme Inhibition Constant Data from BindingDB
Found 4 hits for monomerid = 11509
TargetDipeptidyl peptidase 4(Homo sapiens (Human))
Merck Research Laboratories
LigandPNGBDBM11509((2S,3S)-1-[(3S)-3-fluoropyrrolidin-1-yl]-3-[4-(4-m...)
Affinity DataIC50:  710nM. Assay description: The enzyme activity resulted in the formation of the fluorescent product amidomethylcoumarin (AMC), which was monitored by excitation at 360 nm and m...
In DepthDetails ArticlePubMed
TargetDipeptidyl peptidase 9(Homo sapiens (Human))
Merck Research Laboratories
LigandPNGBDBM11509((2S,3S)-1-[(3S)-3-fluoropyrrolidin-1-yl]-3-[4-(4-m...)
Affinity DataIC50: >1.00E+5nM. Assay description: The enzyme activity resulted in the formation of the fluorescent product amidomethylcoumarin (AMC), which was monitored by excitation at 360 nm and m...
In DepthDetails ArticlePubMed
TargetDipeptidyl peptidase 8(Homo sapiens (Human))
Merck Research Laboratories
LigandPNGBDBM11509((2S,3S)-1-[(3S)-3-fluoropyrrolidin-1-yl]-3-[4-(4-m...)
Affinity DataIC50: >1.00E+5nM. Assay description: The enzyme activity resulted in the formation of the fluorescent product amidomethylcoumarin (AMC), which was monitored by excitation at 360 nm and m...
In DepthDetails ArticlePubMed
TargetDipeptidyl peptidase 2(Homo sapiens (Human))
Merck Research Laboratories
LigandPNGBDBM11509((2S,3S)-1-[(3S)-3-fluoropyrrolidin-1-yl]-3-[4-(4-m...)
Affinity DataIC50:  1.80E+3nM. Assay description: The enzyme activity resulted in the formation of the fluorescent product amidomethylcoumarin (AMC), which was monitored by excitation at 360 nm and m...
In DepthDetails ArticlePubMed