BDBM115097 MLS003115861::SMR001831427::[2-amino-3-(benzenesulfonyloxy)phenyl] benzenesulfonate::[2-azanyl-3-(phenylsulfonyloxy)phenyl] benzenesulfonate::benzenesulfonic acid (2-amino-3-besyloxy-phenyl) ester::benzenesulfonic acid [2-amino-3-(benzenesulfonyloxy)phenyl] ester::cid_328728
SMILES Nc1c(OS(=O)(=O)c2ccccc2)cccc1OS(=O)(=O)c1ccccc1
InChI Key InChIKey=LQTOXLMJIIGBGG-UHFFFAOYSA-N
Data  1 EC50
  Tab Delimited (TSV)   2D SDfile   Computed 3D by Vconf -m prep SDfile
Find this compound or compounds like it in BindingDB:
Activity Spreadsheet -- Enzyme Inhibition Constant Data from BindingDB
Found 1 hit for monomerid = 115097
TargetOxysterols receptor LXR-beta(Homo sapiens (Human))
The Scripps Research Institute Molecular Screening Center
Curated by PubChem BioAssay
LigandPNGBDBM115097(MLS003115861 | SMR001831427 | [2-amino-3-(benzenes...)
Affinity DataEC50:  6.75E+4nM. Assay description: Source (MLPCN Center Name): The Scripps Research Institute Molecular Screening Center Affiliation: UT Southwestern Assay Provider: David Mangelsdorf,...
Ligand InfoPC cidPC sid
In DepthDetails PCBioAssay