BDBM11518 (2S,3S)-1-[(3S)-3-fluoropyrrolidin-1-yl]-3-{4-[3-(1,3,4-oxadiazol-2-yl)phenyl]phenyl}-1-oxobutan-2-aminium; 2,2,2-trifluoroacetate::3-(S)-fluoropyrrolidide 38
SMILES C[C@H]([C@H]([NH3+])C(=O)N1CC[C@H](F)C1)c1ccc(cc1)-c1cccc(c1)-c1nnco1
InChI Key InChIKey=IQLBIWJJBRDGRO-GKCIPKSASA-O
Data  4 IC50
  Tab Delimited (TSV)   2D SDfile   Computed 3D by Vconf -m prep SDfile
Find this compound or compounds like it in BindingDB:
Activity Spreadsheet -- Enzyme Inhibition Constant Data from BindingDB
Found 4 hits for monomerid = 11518
TargetDipeptidyl peptidase 4(Homo sapiens (Human))
Merck Research Laboratories
LigandPNGBDBM11518((2S,3S)-1-[(3S)-3-fluoropyrrolidin-1-yl]-3-{4-[3-(...)
Affinity DataIC50:  69nM. Assay description: The enzyme activity resulted in the formation of the fluorescent product amidomethylcoumarin (AMC), which was monitored by excitation at 360 nm and m...
Ligand InfoPC cidPC sid
In DepthDetails ArticlePubMed
TargetDipeptidyl peptidase 9(Homo sapiens (Human))
Merck Research Laboratories
LigandPNGBDBM11518((2S,3S)-1-[(3S)-3-fluoropyrrolidin-1-yl]-3-{4-[3-(...)
Affinity DataIC50: >1.00E+5nM. Assay description: The enzyme activity resulted in the formation of the fluorescent product amidomethylcoumarin (AMC), which was monitored by excitation at 360 nm and m...
Ligand InfoPC cidPC sid
In DepthDetails ArticlePubMed
TargetDipeptidyl peptidase 8(Homo sapiens (Human))
Merck Research Laboratories
LigandPNGBDBM11518((2S,3S)-1-[(3S)-3-fluoropyrrolidin-1-yl]-3-{4-[3-(...)
Affinity DataIC50: >1.00E+5nM. Assay description: The enzyme activity resulted in the formation of the fluorescent product amidomethylcoumarin (AMC), which was monitored by excitation at 360 nm and m...
Ligand InfoPC cidPC sid
In DepthDetails ArticlePubMed
TargetDipeptidyl peptidase 2(Homo sapiens (Human))
Merck Research Laboratories
LigandPNGBDBM11518((2S,3S)-1-[(3S)-3-fluoropyrrolidin-1-yl]-3-{4-[3-(...)
Affinity DataIC50:  960nM. Assay description: The enzyme activity resulted in the formation of the fluorescent product amidomethylcoumarin (AMC), which was monitored by excitation at 360 nm and m...
Ligand InfoPC cidPC sid
In DepthDetails ArticlePubMed