BDBM116091 US8633183, E-240
SMILES CCc1ncnc(-c2cc(F)c(C(=O)N3CCN(CC(C)(C)O)CC3)c(Cl)c2)c1C#Cc1ccc(N)nc1
InChI Key InChIKey=DHWMEOLHCVFNTG-UHFFFAOYSA-N
Data  2 IC50
  Tab Delimited (TSV)   2D SDfile   Computed 3D by Vconf -m prep SDfile
Find this compound or compounds like it in BindingDB:
Activity Spreadsheet -- Enzyme Inhibition Constant Data from BindingDB
Found 2 hits for monomerid = 116091
TargetSerine/threonine-protein kinase mTOR(Homo sapiens (Human))
Boehringer Ingelheim International
US Patent
LigandPNGBDBM116091(US8633183, E-240)
Affinity DataIC50:  0.290nM. Assay description: The mTOR kinase TR-FRET assay utilizes a physiologically relevant protein substrate for mTOR (4E-BP1, labeled with an acceptor fluorophore (Green Flu...
In DepthDetails US Patent
TargetPhosphatidylinositol 4,5-bisphosphate 3-kinase catalytic subunit alpha isoform(Homo sapiens (Human))
Boehringer Ingelheim International
US Patent
LigandPNGBDBM116091(US8633183, E-240)
Affinity DataIC50:  115nM. Assay description: PI3Kalpha assay described herein provides IC50 values indicating the activity of the compounds inhibiting PI3 kinase alpha activity Inhibition of PI3...
In DepthDetails US Patent