BDBM116323 US8637532, 4
SMILES NCC(Nc1ncnc2c(cccc12)C(N)=O)c1cccc(Cl)c1
InChI Key InChIKey=VXICAQQGSOIIMS-UHFFFAOYSA-N
Data  1 IC50
  Tab Delimited (TSV)   2D SDfile   Computed 3D by Vconf -m prep SDfile
Find this compound or compounds like it in BindingDB:
Activity Spreadsheet -- Enzyme Inhibition Constant Data from BindingDB
Found 1 hit for monomerid = 116323
TargetAurora kinase A(Homo sapiens (Human))
Merck Patent
US Patent
LigandPNGBDBM116323(US8637532, 4)
Affinity DataIC50:  4.90E+3nM. Assay description: The Aurora assays described here are performed on two Caliper Life Sciences systems: the LC3000 and the Desktop Profiler. These provide data on enzym...
In DepthDetails US Patent