BDBM116743 US8637532, 454
SMILES C[C@@H](Nc1ncnc2c(cccc12)C(N)=O)c1cccc(NC(=O)c2cc(F)cc(c2)C(F)(F)F)c1
InChI Key InChIKey=WLBQGGZKKZEQGW-CYBMUJFWSA-N
Data  1 IC50
  Tab Delimited (TSV)   2D SDfile   Computed 3D by Vconf -m prep SDfile
Find this compound or compounds like it in BindingDB:
Activity Spreadsheet -- Enzyme Inhibition Constant Data from BindingDB
Found 1 hit for monomerid = 116743
TargetRibosomal protein S6 kinase beta-1(Homo sapiens (Human))
Merck Patent
US Patent
LigandPNGBDBM116743(US8637532, 454)
Affinity DataIC50:  45nMpH: 7.5 T: 2°C. Assay description: P70S6K inhibitor compounds are diluted and plated in 96 well plates. A reaction mixture including the following components is then added to the compo...
In DepthDetails US Patent