BDBM116761 US8637532, 475
SMILES CC(Nc1ncnc2c(cccc12)C(N)=O)c1cccc(NC(=O)c2ccc(OC(F)(F)F)cc2)c1
InChI Key InChIKey=SZUFVMKRAKNXNR-UHFFFAOYSA-N
Data  3 IC50
  Tab Delimited (TSV)   2D SDfile   Computed 3D by Vconf -m prep SDfile
Find this compound or compounds like it in BindingDB:
Activity Spreadsheet -- Enzyme Inhibition Constant Data from BindingDB
Found 3 hits for monomerid = 116761
TargetRibosomal protein S6 kinase beta-1(Homo sapiens (Human))
Merck Patent
US Patent
LigandPNGBDBM116761(US8637532, 475)
Affinity DataIC50:  60nMpH: 7.5 T: 2°C. Assay description: P70S6K inhibitor compounds are diluted and plated in 96 well plates. A reaction mixture including the following components is then added to the compo...
In DepthDetails US Patent
Target3-phosphoinositide-dependent protein kinase 1(Homo sapiens (Human))
Merck Patent
US Patent
LigandPNGBDBM116761(US8637532, 475)
Affinity DataIC50:  8.60E+4nMpH: 7.5 T: 2°C. Assay description: The kinase assay is performed as 384-well Flashplate assay (PerkinElmer LAS Germany GmbH). 3.4 nM His6-PDK1(Delta 1-50) (PDK1 that has a His-tag cons...
In DepthDetails US Patent
TargetAurora kinase A(Homo sapiens (Human))
Merck Patent
US Patent
LigandPNGBDBM116761(US8637532, 475)
Affinity DataIC50:  0.530nM. Assay description: The Aurora assays described here are performed on two Caliper Life Sciences systems: the LC3000 and the Desktop Profiler. These provide data on enzym...
In DepthDetails US Patent